BDBM50090753 1-[2-(2-{2-[2-(2-Amino-3-naphthalen-2-yl-propionylamino)-3-phenyl-propionylamino]-3-phenyl-propionylamino}-acetylamino)-5-guanidino-pentanoyl]-pyrrolidine-2-carboxylic acid (1-carbamoyl-ethyl)-amide::CHEMBL93608
SMILES C[C@H](NC(=O)[C@H]1CCCN1C(=O)[C@@H](CCCNC(N)=N)NC(=O)CNC(=O)[C@@H](Cc1ccccc1)NC(=O)[C@@H](Cc1ccccc1)NC(=O)[C@@H](N)Cc1ccc2ccccc2c1)C(N)=O
InChI Key InChIKey=LIJSFARWLMFZMG-VPJOEIOUSA-N
Data  1 IC50
  Tab Delimited (TSV)   2D SDfile   Computed 3D by Vconf -m prep SDfile
Find this compound or compounds like it in BindingDB:
Activity Spreadsheet -- Enzyme Inhibition Constant Data from BindingDB
Found 1 hit for monomerid = 50090753
TargetGonadotropin-releasing hormone receptor(Rattus norvegicus)
Institute Of Science
Curated by ChEMBL
LigandPNGBDBM50090753(1-[2-(2-{2-[2-(2-Amino-3-naphthalen-2-yl-propionyl...)
Affinity DataIC50:  280nM. Assay description: Concentration of the peptide which displaces 50% of 125 I-[D-Lys6] gonadotropin-releasing hormone bound to rat pituitary membranes
In DepthDetails ArticlePubMed