BDBM50090941 3-(2-{4-[3-(2,6-Dichloro-phenyl)-5-isopropyl-isoxazol-4-ylmethoxy]-2,6-dimethyl-phenyl}-vinyl)-benzoic acid::CHEMBL319861
SMILES CC(C)c1onc(c1COc1cc(C)c(\C=C\c2cccc(c2)C(O)=O)c(C)c1)-c1c(Cl)cccc1Cl
InChI Key InChIKey=ZJZPTIZEFOUUEZ-VAWYXSNFSA-N
Data  1 EC50
  Tab Delimited (TSV)   2D SDfile   Computed 3D by Vconf -m prep SDfile
Find this compound or compounds like it in BindingDB:
Activity Spreadsheet -- Enzyme Inhibition Constant Data from BindingDB
Found 1 hit for monomerid = 50090941
TargetBile acid receptor(Homo sapiens (Human))
Glaxo Wellcome Research & Development
Curated by ChEMBL
LigandPNGBDBM50090941(3-(2-{4-[3-(2,6-Dichloro-phenyl)-5-isopropyl-isoxa...)
Affinity DataEC50:  100nM. Assay description: Ligand dependent recruitment of SRC1(676-700) peptide to human Farnesoid X-activated receptor by fluorescence resonance energy transfer assay
In DepthDetails ArticlePubMed