BDBM50091153 Benzyl-[3-(2-chloro-phenothiazin-10-yl)-propyl]-dimethyl-ammonium (0FK000)::CHEMBL106732
SMILES C[N+](C)(CCCN1c2ccccc2Sc2ccc(Cl)cc12)Cc1ccccc1
InChI Key InChIKey=IHZUPFWCAHBWBI-UHFFFAOYSA-N
Data  1 KI  1 IC50
  Tab Delimited (TSV)   2D SDfile   Computed 3D by Vconf -m prep SDfile
Find this compound or compounds like it in BindingDB:
Activity Spreadsheet -- Enzyme Inhibition Constant Data from BindingDB
Found 2 hits for monomerid = 50091153
TargetTrypanothione reductase(Trypanosoma cruzi)
University Of Manchester
Curated by ChEMBL
LigandPNGBDBM50091153(Benzyl-[3-(2-chloro-phenothiazin-10-yl)-propyl]-di...)
Affinity DataKi:  1.30E+3nM. Assay description: Inhibitory activity against Trypanosoma cruzi trypanothione reductase
In DepthDetails ArticlePubMed
TargetTrypanothione reductase(Trypanosoma cruzi)
University Of Manchester
Curated by ChEMBL
LigandPNGBDBM50091153(Benzyl-[3-(2-chloro-phenothiazin-10-yl)-propyl]-di...)
Affinity DataIC50:  8.02E+3nM. Assay description: Inhibitory activity against Trypanosoma cruzi trypanothione reductase
In DepthDetails ArticlePubMed