BDBM50091160 CHEMBL106127::[3-(2-Chloro-phenothiazin-10-yl)-propyl]-(3,4-dichloro-benzyl)-dimethyl-ammonium (OFK006)
SMILES C[N+](C)(CCCN1c2ccccc2Sc2ccc(Cl)cc12)Cc1ccc(Cl)c(Cl)c1
InChI Key InChIKey=FXXODVQDKRTWKN-UHFFFAOYSA-N
Data  1 KI  1 IC50
  Tab Delimited (TSV)   2D SDfile   Computed 3D by Vconf -m prep SDfile
Find this compound or compounds like it in BindingDB:
Activity Spreadsheet -- Enzyme Inhibition Constant Data from BindingDB
Found 2 hits for monomerid = 50091160
TargetTrypanothione reductase(Trypanosoma cruzi)
University Of Manchester
Curated by ChEMBL
LigandPNGBDBM50091160(CHEMBL106127 | [3-(2-Chloro-phenothiazin-10-yl)-pr...)
Affinity DataKi:  120nM. Assay description: Inhibitory activity against Trypanosoma cruzi trypanothione reductase
In DepthDetails ArticlePubMed
TargetTrypanothione reductase(Trypanosoma cruzi)
University Of Manchester
Curated by ChEMBL
LigandPNGBDBM50091160(CHEMBL106127 | [3-(2-Chloro-phenothiazin-10-yl)-pr...)
Affinity DataIC50:  780nM. Assay description: Inhibitory activity against Trypanosoma cruzi trypanothione reductase
In DepthDetails ArticlePubMed