BDBM50091373 1-{2-Fluoro-4-[3-(1H-imidazol-4-yl)-propoxy]-phenyl}-ethanone oxime; compound with but-2-enedioic acid::CHEMBL321835
SMILES CC(N=O)c1ccc(OCCCc2cnc[nH]2)cc1F
InChI Key InChIKey=UNDYQBFNVSLYTK-UHFFFAOYSA-N
Data  1 KI
  Tab Delimited (TSV)   2D SDfile   Computed 3D by Vconf -m prep SDfile
Find this compound or compounds like it in BindingDB:
Activity Spreadsheet -- Enzyme Inhibition Constant Data from BindingDB
Found 1 hit for monomerid = 50091373
TargetHistamine H3 receptor(Rattus norvegicus (rat))
Freie UniversitäT Berlin
Curated by ChEMBL
LigandPNGBDBM50091373(1-{2-Fluoro-4-[3-(1H-imidazol-4-yl)-propoxy]-pheny...)
Affinity DataKi:  0.300nM. Assay description: Histamine H3 receptor antagonist activity in an assay with K+ evoked depolarization-induced release of [3H]-histamine from rat synaptosomes.
In DepthDetails ArticlePubMed