BDBM50091399 CHEMBL3582288
SMILES COc1ccc(cc1F)-c1cc(F)c2ncc(Cc3ccc4ncccc4c3)n2c1
InChI Key InChIKey=NVKAWKQGWWIWPM-HAFWKYOQSA-N
Data  1 IC50
  Tab Delimited (TSV)   2D SDfile   Computed 3D by Vconf -m prep SDfile
Find this compound or compounds like it in BindingDB:
Activity Spreadsheet -- Enzyme Inhibition Constant Data from BindingDB
Found 1 hit for monomerid = 50091399
TargetHepatocyte growth factor receptor(Homo sapiens (Human))
Shanghai Institute Of Materia Medica
Curated by ChEMBL
LigandPNGBDBM50091399(CHEMBL3582288)
Affinity DataIC50:  2.80nM. Assay description: Inhibition of C-Met (unknown origin) using polu (Glu,Tyr)4:1 substrate after 30 mins incubation by multi-well spectrophotometry
In DepthDetails ArticlePubMed