BDBM50091413 CHEMBL3582273
SMILES Cn1cc(cn1)-c1cc(Cl)c2ncc(Cc3ccc4ncccc4c3)n2c1
InChI Key InChIKey=UNEXBUPPDWPCJV-UHFFFAOYSA-N
Data  1 IC50
  Tab Delimited (TSV)   2D SDfile   Computed 3D by Vconf -m prep SDfile
Find this compound or compounds like it in BindingDB:
Activity Spreadsheet -- Enzyme Inhibition Constant Data from BindingDB
Found 1 hit for monomerid = 50091413
TargetHepatocyte growth factor receptor(Homo sapiens (Human))
Shanghai Institute Of Materia Medica
Curated by ChEMBL
LigandPNGBDBM50091413(CHEMBL3582273)
Affinity DataIC50:  2.18E+3nM. Assay description: Inhibition of C-Met (unknown origin) using polu (Glu,Tyr)4:1 substrate after 30 mins incubation by multi-well spectrophotometry
In DepthDetails ArticlePubMed