BDBM50091473 (S)-2-Amino-4-(1-ethyl-propylidene)-pentanedioic acid::CHEMBL51008::LY-339687
SMILES [#6]-[#6]\[#6](-[#6]-[#6])=[#6](/[#6]-[#6@H](-[#7])-[#6](-[#8])=O)-[#6](-[#8])=O
InChI Key InChIKey=WGIDMAYAWXETPY-QMMMGPOBSA-N
Data  7 KI
  Tab Delimited (TSV)   2D SDfile   Computed 3D by Vconf -m prep SDfile
Find this compound or compounds like it in BindingDB:
Activity Spreadsheet -- Enzyme Inhibition Constant Data from BindingDB
Found 7 hits for monomerid = 50091473
TargetGlutamate receptor ionotropic, kainate 1(Homo sapiens (Human))
Eli Lilly
Curated by ChEMBL
LigandPNGBDBM50091473((S)-2-Amino-4-(1-ethyl-propylidene)-pentanedioic a...)
Affinity DataKi:  241nM. Assay description: Binding affinity of compound was determined against Ionotropic glutamate receptor ionotropic kainate 1 using cell membranes prepared from HEK293 cell...
In DepthDetails ArticlePubMed
TargetGlutamate receptor 4(Homo sapiens (Human))
Eli Lilly
Curated by ChEMBL
LigandPNGBDBM50091473((S)-2-Amino-4-(1-ethyl-propylidene)-pentanedioic a...)
Affinity DataKi:  4.71E+3nM. Assay description: Binding affinity of compound was determined against Ionotropic glutamate receptor AMPA 4 using cell membranes prepared from HEK293 cells
In DepthDetails ArticlePubMed
TargetGlutamate receptor ionotropic, kainate 3(Homo sapiens (Human))
Eli Lilly
Curated by ChEMBL
LigandPNGBDBM50091473((S)-2-Amino-4-(1-ethyl-propylidene)-pentanedioic a...)
Affinity DataKi:  1.24E+4nM. Assay description: Binding affinity of compound was determined against Ionotropic glutamate receptor ionotropic kainate 3 using cell membranes prepared from HEK293 cell...
In DepthDetails ArticlePubMed
TargetGlutamate receptor ionotropic, kainate 5(Homo sapiens (Human))
Eli Lilly
Curated by ChEMBL
LigandPNGBDBM50091473((S)-2-Amino-4-(1-ethyl-propylidene)-pentanedioic a...)
Affinity DataKi:  2.14E+4nM. Assay description: Binding affinity of compound was determined against Glutamate receptor (KA2) using cell membranes prepared from HEK293 cells
In DepthDetails ArticlePubMed
TargetGlutamate receptor 1(Homo sapiens (Human))
Eli Lilly
Curated by ChEMBL
LigandPNGBDBM50091473((S)-2-Amino-4-(1-ethyl-propylidene)-pentanedioic a...)
Affinity DataKi: >1.00E+5nM. Assay description: Binding affinity of compound was determined against Ionotropic glutamate receptor AMPA 1 using cell membranes prepared from HEK293 cells
In DepthDetails ArticlePubMed
TargetGlutamate receptor ionotropic, kainate 2(Homo sapiens (Human))
Eli Lilly
Curated by ChEMBL
LigandPNGBDBM50091473((S)-2-Amino-4-(1-ethyl-propylidene)-pentanedioic a...)
Affinity DataKi:  2.07E+5nM. Assay description: Binding affinity of compound was determined against Ionotropic glutamate receptor ionotropic kainate 2 using cell membranes prepared from HEK293 cell...
In DepthDetails ArticlePubMed
TargetGlutamate receptor 2(Homo sapiens (Human))
Eli Lilly
Curated by ChEMBL
LigandPNGBDBM50091473((S)-2-Amino-4-(1-ethyl-propylidene)-pentanedioic a...)
Affinity DataKi:  2.81E+5nM. Assay description: Binding affinity of compound was determined against Ionotropic glutamate receptor AMPA 2 using cell membranes prepared from HEK293 cells
In DepthDetails ArticlePubMed