BDBM50091478 (S)-2-Amino-4-pentylidene-pentanedioicacid::CHEMBL297919
SMILES CCCC\C=C(\C[C@H](N)C(O)=O)C(O)=O
InChI Key InChIKey=SNPRXXDJCSRVQY-TVSKSKRASA-N
Data  2 KI
  Tab Delimited (TSV)   2D SDfile   Computed 3D by Vconf -m prep SDfile
Find this compound or compounds like it in BindingDB:
Activity Spreadsheet -- Enzyme Inhibition Constant Data from BindingDB
Found 2 hits for monomerid = 50091478
TargetGlutamate receptor ionotropic, kainate 1(Homo sapiens (Human))
Eli Lilly
Curated by ChEMBL
LigandPNGBDBM50091478((S)-2-Amino-4-pentylidene-pentanedioicacid | CHEMB...)
Affinity DataKi:  150nM. Assay description: Binding affinity of compound was determined against Ionotropic glutamate receptor ionotropic kainate 1 using cell membranes prepared from HEK293 cell...
In DepthDetails ArticlePubMed
TargetGlutamate receptor ionotropic, kainate 2(Homo sapiens (Human))
Eli Lilly
Curated by ChEMBL
LigandPNGBDBM50091478((S)-2-Amino-4-pentylidene-pentanedioicacid | CHEMB...)
Affinity DataKi:  1.25E+5nM. Assay description: Binding affinity of compound was determined against Ionotropic glutamate receptor ionotropic kainate 2 using cell membranes prepared from HEK293 cell...
In DepthDetails ArticlePubMed