BDBM50091653 CHEMBL266021::N-alpha-Ac-[Nle24,28,30,Nva31]PYY(22-36)-NH2(N-alpha-Ac-ASNleAHYNleNNleNvaTRQRY-NH2)
SMILES CCCC[C@H](NC(=O)[C@H](CO)NC(=O)[C@H](C)NC(C)=O)C(=O)N[C@@H](CCCNC(N)=N)C(=O)N[C@@H](Cc1cnc[nH]1)C(=O)N[C@@H](Cc1ccc(O)cc1)C(=O)N[C@@H](CCCC)C(=O)N[C@@H](CC(N)=O)C(=O)N[C@@H](CCCC)C(=O)N[C@@H](CCC)C(=O)N[C@@H]([C@@H](C)O)C(=O)N[C@@H](CCCNC(N)=N)C(=O)N[C@@H](CCC(N)=O)C(=O)N[C@@H](CCCNC(N)=N)C(=O)N[C@@H](Cc1ccc(O)cc1)C(N)=O
InChI Key InChIKey=OILISECDVFBMHL-NURWRMOQSA-N
Data  3 IC50
  Tab Delimited (TSV)   2D SDfile   Computed 3D by Vconf -m prep SDfile
Find this compound or compounds like it in BindingDB:
Activity Spreadsheet -- Enzyme Inhibition Constant Data from BindingDB
Found 3 hits for monomerid = 50091653
TargetNeuropeptide Y receptor type 2(Homo sapiens (Human))
University Of Cincinnati Medical Center
Curated by ChEMBL
LigandPNGBDBM50091653(CHEMBL266021 | N-alpha-Ac-[Nle24,28,30,Nva31]PYY(2...)
Affinity DataIC50:  57nM. Assay description: Affinity against Neuropeptide Y receptor Y2 in SK-N-BE2 cell line
In DepthDetails ArticlePubMed
TargetNeuropeptide Y receptor type 1(Homo sapiens (Human))
University Of Cincinnati Medical Center
Curated by ChEMBL
LigandPNGBDBM50091653(CHEMBL266021 | N-alpha-Ac-[Nle24,28,30,Nva31]PYY(2...)
Affinity DataIC50:  1.59E+3nM. Assay description: Affinity against Neuropeptide Y receptor Y1 in SK-N-MC cell line
In DepthDetails ArticlePubMed
TargetNeuropeptide Y receptor type 2(RAT)
University Of Cincinnati Medical Center
Curated by ChEMBL
LigandPNGBDBM50091653(CHEMBL266021 | N-alpha-Ac-[Nle24,28,30,Nva31]PYY(2...)
Affinity DataIC50:  0.590nM. Assay description: Antisecretory potency, affinity for intestinal PYY of rat jejunum by using short circuit current (SCC) method.
In DepthDetails ArticlePubMed