BDBM50091711 5-(4-Chloro-phenyl)-1-methyl-piperidine-2-thione::CHEMBL56517
SMILES CN1CC(CCC1=S)c1ccc(Cl)cc1
InChI Key InChIKey=FTCLELCCXKHRQL-UHFFFAOYSA-N
Data  1 IC50
  Tab Delimited (TSV)   2D SDfile   Computed 3D by Vconf -m prep SDfile
Find this compound or compounds like it in BindingDB:
Activity Spreadsheet -- Enzyme Inhibition Constant Data from BindingDB
Found 1 hit for monomerid = 50091711
Target3-oxo-5-alpha-steroid 4-dehydrogenase 1(Homo sapiens (Human))
University Of Canterbury
Curated by ChEMBL
LigandPNGBDBM50091711(5-(4-Chloro-phenyl)-1-methyl-piperidine-2-thione |...)
Affinity DataIC50:  3.36E+3nM. Assay description: In vitro inhibitory activity against Steroid 5-alpha-reductase type I
In DepthDetails ArticlePubMed