BDBM50091801 6-Isobutyl-4-methyl-pyridin-2-ylamine::6-isobutyl-4-methylpyridin-2-amine::CHEMBL294609
SMILES CC(C)Cc1cc(C)cc(N)n1
InChI Key InChIKey=VMTPVCVORKDABN-UHFFFAOYSA-N
Data  7 IC50
  Tab Delimited (TSV)   2D SDfile   Computed 3D by Vconf -m prep SDfile
Find this compound or compounds like it in BindingDB:
Activity Spreadsheet -- Enzyme Inhibition Constant Data from BindingDB
Found 7 hits for monomerid = 50091801
TargetNitric oxide synthase, brain(Homo sapiens (Human))
Merck Research Laboratories
Curated by ChEMBL
LigandPNGBDBM50091801(6-Isobutyl-4-methyl-pyridin-2-ylamine | 6-isobutyl...)
Affinity DataIC50:  100nM. Assay description: Inhibitory activity against neuronal nitric oxide synthase
In DepthDetails ArticlePubMed
TargetNitric oxide synthase, inducible(Homo sapiens (Human))
Merck Research Laboratories
Curated by ChEMBL
LigandPNGBDBM50091801(6-Isobutyl-4-methyl-pyridin-2-ylamine | 6-isobutyl...)
Affinity DataIC50:  28nM. Assay description: Inhibitory activity against inducible nitric oxide synthase (iNOS)
In DepthDetails ArticlePubMed
TargetNitric oxide synthase, endothelial(Homo sapiens (Human))
Merck Research Laboratories
Curated by ChEMBL
LigandPNGBDBM50091801(6-Isobutyl-4-methyl-pyridin-2-ylamine | 6-isobutyl...)
Affinity DataIC50:  150nM. Assay description: Inhibitory activity against endothelial nitric oxide synthase (eNOS)
In DepthDetails ArticlePubMed
TargetNitric oxide synthase, inducible(Homo sapiens (Human))
Merck Research Laboratories
Curated by ChEMBL
LigandPNGBDBM50091801(6-Isobutyl-4-methyl-pyridin-2-ylamine | 6-isobutyl...)
Affinity DataIC50:  193nM. Assay description: Inhibition of human recombinant iNOS using 1 mM NADH and 2 uM L-arginine after 30 mins
In DepthDetails ArticlePubMed
TargetNitric oxide synthase, endothelial(Homo sapiens (Human))
Merck Research Laboratories
Curated by ChEMBL
LigandPNGBDBM50091801(6-Isobutyl-4-methyl-pyridin-2-ylamine | 6-isobutyl...)
Affinity DataIC50:  150nM. Assay description: Inhibition of human eNOS
In DepthDetails ArticlePubMed
TargetNitric oxide synthase, brain(Homo sapiens (Human))
Merck Research Laboratories
Curated by ChEMBL
LigandPNGBDBM50091801(6-Isobutyl-4-methyl-pyridin-2-ylamine | 6-isobutyl...)
Affinity DataIC50:  100nM. Assay description: Inhibition of human nNOS
In DepthDetails ArticlePubMed
TargetNitric oxide synthase, inducible(Homo sapiens (Human))
Merck Research Laboratories
Curated by ChEMBL
LigandPNGBDBM50091801(6-Isobutyl-4-methyl-pyridin-2-ylamine | 6-isobutyl...)
Affinity DataIC50:  28nM. Assay description: Inhibition of human iNOS
In DepthDetails ArticlePubMed