BDBM50091975 3-Hydroxy-naphthalene-2-carboxylic acid (4-cyano-phenyl)-amide::CHEMBL65742
SMILES Oc1cc2ccccc2cc1C(=O)Nc1ccc(cc1)C#N
InChI Key InChIKey=DRBIYQSSEMTUJQ-UHFFFAOYSA-N
Data  1 IC50
  Tab Delimited (TSV)   2D SDfile   Computed 3D by Vconf -m prep SDfile
Find this compound or compounds like it in BindingDB:
Activity Spreadsheet -- Enzyme Inhibition Constant Data from BindingDB
Found 1 hit for monomerid = 50091975
TargetDNA polymerase catalytic subunit(Human herpesvirus 6A (strain Uganda-1102) (HHV-6 v...)
Pharmacia
Curated by ChEMBL
LigandPNGBDBM50091975(3-Hydroxy-naphthalene-2-carboxylic acid (4-cyano-p...)
Affinity DataIC50:  1.90E+4nM. Assay description: Inhibitory activity against Human Cytomegalovirus (HCMV) polymerase
In DepthDetails ArticlePubMed