BDBM50092067 CHEMBL3582424::US9296728, 16
SMILES COc1cc(ccc1\C=C(/C#N)C(O)=O)N(CC=C)CC=C
InChI Key InChIKey=VQTBBBGKBIKAAN-UHFFFAOYSA-N
Data  2 IC50
  Tab Delimited (TSV)   2D SDfile   Computed 3D by Vconf -m prep SDfile
Find this compound or compounds like it in BindingDB:
Activity Spreadsheet -- Enzyme Inhibition Constant Data from BindingDB
Found 2 hits for monomerid = 50092067
TargetMonocarboxylate transporter 1(Rattus norvegicus (Rat))
Medical School Duluth
Curated by ChEMBL
LigandPNGBDBM50092067(CHEMBL3582424 | US9296728, 16)
Affinity DataIC50:  29nM. Assay description: Inhibition of MCT1-mediated lactate transport in rat RBE4 cells incubated for 15 mins by [14C]-lactate uptake assay
In DepthDetails ArticlePubMed
TargetMonocarboxylate transporter 1(Rattus norvegicus (Rat))
Medical School Duluth
Curated by ChEMBL
LigandPNGBDBM50092067(CHEMBL3582424 | US9296728, 16)
Affinity DataIC50:  25nMpH: 7.43 T: 2°C. Assay description: The entire lactate uptake studies for the inhibition of MCT1 were carried out on RBE4 (Rat Brain Endothelial 4) cells. The expression of MCT1 on thes...
In DepthDetails US Patent