BDBM50092265 CHEMBL3581302
SMILES [#6]-n1cc2c(n1)nc(\[#7]=[#6](/[#7]-c1ccc(Cl)cc1)-[#7]-c1ccc(Cl)cc1)n1nc(nc21)-c1ccco1
InChI Key InChIKey=NQOPEIAFOGFMCM-UHFFFAOYSA-N
Data  3 KI
  Tab Delimited (TSV)   2D SDfile   Computed 3D by Vconf -m prep SDfile
Find this compound or compounds like it in BindingDB:
Activity Spreadsheet -- Enzyme Inhibition Constant Data from BindingDB
Found 3 hits for monomerid = 50092265
TargetAdenosine receptor A3(Homo sapiens (Human))
Universit£
Curated by ChEMBL
LigandPNGBDBM50092265(CHEMBL3581302)
Affinity DataKi:  71nM. Assay description: Displacement of [3H]-MRE3008F20 from human adenosine A3 receptor expressed in CHO cell membranes after 120 mins by scintillation counting analysis
In DepthDetails ArticlePubMed
TargetAdenosine receptor A1(Homo sapiens (Human))
Universit£
Curated by ChEMBL
LigandPNGBDBM50092265(CHEMBL3581302)
Affinity DataKi: >1.00E+3nM. Assay description: Displacement of [3H]-DPCPX from human adenosine A1 receptor expressed in CHO cell membranes after 120 mins by scintillation counting analysis
In DepthDetails ArticlePubMed
TargetAdenosine receptor A2a(Homo sapiens (Human))
Universit£
Curated by ChEMBL
LigandPNGBDBM50092265(CHEMBL3581302)
Affinity DataKi: >1.00E+3nM. Assay description: Displacement of [3H]-ZM241385 from human adenosine A2A receptor expressed in CHO cell membranes after 60 mins by scintillation counting analysis
In DepthDetails ArticlePubMed