BDBM50092285 4-[4-Oxo-2-thioxo-thiazolidin-(5Z)-ylidenemethyl]-benzonitrile::CHEMBL68578
SMILES SC1=NC(=O)C(S1)=Cc1ccc(cc1)C#N
InChI Key InChIKey=KQZYUFUWQRAWLE-UHFFFAOYSA-N
Data  2 IC50
  Tab Delimited (TSV)   2D SDfile   Computed 3D by Vconf -m prep SDfile
Find this compound or compounds like it in BindingDB:
Activity Spreadsheet -- Enzyme Inhibition Constant Data from BindingDB
Found 2 hits for monomerid = 50092285
TargetBeta-lactamase(Enterobacter cloacae)
The R. W. Johnson Pharmaceutical Research Institute
Curated by ChEMBL
LigandPNGBDBM50092285(4-[4-Oxo-2-thioxo-thiazolidin-(5Z)-ylidenemethyl]-...)
Affinity DataIC50: >7.00E+5nM. Assay description: Inhibitory activity against class A Beta-lactamase TEM isolated from Enterobacter coli
In DepthDetails ArticlePubMed
TargetBeta-lactamase(Enterobacter cloacae)
The R. W. Johnson Pharmaceutical Research Institute
Curated by ChEMBL
LigandPNGBDBM50092285(4-[4-Oxo-2-thioxo-thiazolidin-(5Z)-ylidenemethyl]-...)
Affinity DataIC50:  5.00E+5nM. Assay description: Inhibitory activity against class C Beta-lactamase isolated from Enterobacter cloacae
In DepthDetails ArticlePubMed