BDBM50092353 CHEMBL3586125
SMILES Cc1cc2nc([nH]c2cc1C)-c1ccc(cc1)-c1nnc(o1)-c1ccncc1
InChI Key InChIKey=ZDMBKIHGRXLNRP-UHFFFAOYSA-N
Data  1 IC50
  Tab Delimited (TSV)   2D SDfile   Computed 3D by Vconf -m prep SDfile
Find this compound or compounds like it in BindingDB:
Activity Spreadsheet -- Enzyme Inhibition Constant Data from BindingDB
Found 1 hit for monomerid = 50092353
TargetBeta-glucuronidase(Homo sapiens (Human))
Universiti Teknologi Mara
Curated by ChEMBL
LigandPNGBDBM50092353(CHEMBL3586125)
Affinity DataIC50:  4.01E+4nM. Assay description: Inhibition of beta-D-glucuronidase (unknown origin) assessed as reduction in p-nitrophenol formation using p-nitrophenyl-beta-D-glucuronide substarte...
In DepthDetails ArticlePubMed