BDBM50092464 CHEMBL3586114
SMILES Cc1cc2nc([nH]c2cc1C)-c1ccc(cc1)-c1nnc(o1)-c1cccc(c1)[N+]([O-])=O
InChI Key InChIKey=JDRIFBYEUBWRTP-UHFFFAOYSA-N
Data  1 IC50
  Tab Delimited (TSV)   2D SDfile   Computed 3D by Vconf -m prep SDfile
Find this compound or compounds like it in BindingDB:
Activity Spreadsheet -- Enzyme Inhibition Constant Data from BindingDB
Found 1 hit for monomerid = 50092464
TargetBeta-glucuronidase(Homo sapiens (Human))
Universiti Teknologi Mara
Curated by ChEMBL
LigandPNGBDBM50092464(CHEMBL3586114)
Affinity DataIC50:  1.11E+4nM. Assay description: Inhibition of beta-D-glucuronidase (unknown origin) assessed as reduction in p-nitrophenol formation using p-nitrophenyl-beta-D-glucuronide substarte...
In DepthDetails ArticlePubMed