BDBM50092486 4-Methyl-5,6-dihydro-pyrido[1,2-a]quinolin-3-one::CHEMBL124849
SMILES Cc1c2CCc3ccccc3-n2ccc1=O
InChI Key InChIKey=POEIHRYHSHOMRL-UHFFFAOYSA-N
Data  1 IC50
  Tab Delimited (TSV)   2D SDfile   Computed 3D by Vconf -m prep SDfile
Find this compound or compounds like it in BindingDB:
Activity Spreadsheet -- Enzyme Inhibition Constant Data from BindingDB
Found 1 hit for monomerid = 50092486
Target3-oxo-5-alpha-steroid 4-dehydrogenase 1(Homo sapiens (Human))
Universit£
Curated by ChEMBL
LigandPNGBDBM50092486(4-Methyl-5,6-dihydro-pyrido[1,2-a]quinolin-3-one |...)
Affinity DataIC50:  1.40E+3nM. Assay description: Inhibition of recombinant Steroid 5-alpha-reductase type I expressed in CHO cells
In DepthDetails ArticlePubMed