BDBM50092502 4-Methyl-1,2,5,6-tetrahydro-pyrido[1,2-a]quinolin-3-one::4-methyl-1,2,5,6-tetrahydro pyrido[1,2-a]quinolin-3-one::CHEMBL118447
SMILES CC1=C2CCc3ccccc3N2CCC1=O
InChI Key InChIKey=DXHLMUSXIWMQGZ-UHFFFAOYSA-N
Data  2 IC50
  Tab Delimited (TSV)   2D SDfile   Computed 3D by Vconf -m prep SDfile
Find this compound or compounds like it in BindingDB:
Activity Spreadsheet -- Enzyme Inhibition Constant Data from BindingDB
Found 2 hits for monomerid = 50092502
Target3-oxo-5-alpha-steroid 4-dehydrogenase 1(Homo sapiens (Human))
Universit£
Curated by ChEMBL
LigandPNGBDBM50092502(4-Methyl-1,2,5,6-tetrahydro-pyrido[1,2-a]quinolin-...)
Affinity DataIC50:  185nM. Assay description: Inhibition of recombinant steroid 5-alpha-reductase type I expressed in CHO cells
In DepthDetails ArticlePubMed
Target3-oxo-5-alpha-steroid 4-dehydrogenase 1(Homo sapiens (Human))
Universit£
Curated by ChEMBL
LigandPNGBDBM50092502(4-Methyl-1,2,5,6-tetrahydro-pyrido[1,2-a]quinolin-...)
Affinity DataIC50:  185nM. Assay description: Inhibitory concentration against human recombinant steroid 5-alpha-reductase type I in stably transfected chinese hamster ovary (CHO) 1827 cells usin...
In DepthDetails ArticlePubMed