BDBM50092787 CHEMBL3585359
SMILES CC(C)(O)c1ccc(cn1)-c1cnc2NCC(=O)N(CCC3CCOCC3)c2n1
InChI Key InChIKey=SSVPJPIEWYQHJS-UHFFFAOYSA-N
Data  2 IC50
  Tab Delimited (TSV)   2D SDfile   Computed 3D by Vconf -m prep SDfile
Find this compound or compounds like it in BindingDB:
Activity Spreadsheet -- Enzyme Inhibition Constant Data from BindingDB
Found 2 hits for monomerid = 50092787
TargetSerine/threonine-protein kinase mTOR(Homo sapiens (Human))
Celgene
Curated by ChEMBL
LigandPNGBDBM50092787(CHEMBL3585359)
Affinity DataIC50:  33nM. Assay description: Inhibition of mTOR (unknown origin) by HTR-FRET substrate phosphorylation assay
In DepthDetails ArticlePubMed
TargetFKBP12A/mTOR(Homo sapiens (Human))
Celgene
Curated by ChEMBL
LigandPNGBDBM50092787(CHEMBL3585359)
Affinity DataIC50:  240nM. Assay description: Inhibition of mTORC1 in human PC3 cells assessed as inhibition of S6 phosphorylation after 1 hr
In DepthDetails ArticlePubMed