BDBM50092805 CHEMBL3586410
SMILES C\C(CC\C=C(/C)CC[C@H]1C(=C)CCCC1(C)C)=C/C[n+]1cn(C)c2ncnc(N)c12
InChI Key InChIKey=PPCBHTAMQFLZHZ-VTUSAZOXSA-N
Data  1 IC50
  Tab Delimited (TSV)   2D SDfile   Computed 3D by Vconf -m prep SDfile
Find this compound or compounds like it in BindingDB:
Activity Spreadsheet -- Enzyme Inhibition Constant Data from BindingDB
Found 1 hit for monomerid = 50092805
TargetTyrosine-protein phosphatase non-receptor type 1(Homo sapiens (Human))
Tohoku Pharmaceutical University
Curated by ChEMBL
LigandPNGBDBM50092805(CHEMBL3586410)
Affinity DataIC50: >2.40E+4nM. Assay description: Inhibition of human recombinant PTP1B using pNPP as substrate assessed as rate of hydrolysis incubated for 10 mins prior to substrate addition measur...
In DepthDetails ArticlePubMed