BDBM50093158 1-{4-[4-amino(imino)methylaminobenzylcarbamoyl]hexahydro-1-pyrazinylcarbonyloxy}-5-[4-(5-aminopentylcarbamoyl)hexahydro-1-pyrazinylcarbonyloxy]cyclooctane::CHEMBL42900::Derivative of piperazine-1-carboxylic acid 5-(piperazine-1-carbonyloxy)-cyclooctyl ester
SMILES [#7]-[#6]-[#6]-[#6]-[#6]-[#6]-[#7]-[#6](=O)-[#7]-1-[#6]-[#6]-[#7](-[#6]-[#6]-1)-[#6](=O)-[#8]-[#6@H]-1-[#6]-[#6]-[#6]-[#6@H](-[#6]-[#6]-[#6]-1)-[#8]-[#6](=O)-[#7]-1-[#6]-[#6]-[#7](-[#6]-[#6]-1)-[#6](=O)-[#7]-[#6]-c1ccc(cc1)\[#7]=[#6](/[#7])-[#7]
InChI Key InChIKey=BJUPAZWABXENNS-HNRBIFIRSA-N
Data  4 KI
  Tab Delimited (TSV)   2D SDfile   Computed 3D by Vconf -m prep SDfile
Find this compound or compounds like it in BindingDB:
Activity Spreadsheet -- Enzyme Inhibition Constant Data from BindingDB
Found 4 hits for monomerid = 50093158
TargetTryptase beta-2/delta/gamma(Homo sapiens (Human))
Axys Pharmaceuticals
Curated by ChEMBL
LigandPNGBDBM50093158(1-{4-[4-amino(imino)methylaminobenzylcarbamoyl]hex...)
Affinity DataKi:  0.5nM. Assay description: Evaluated for its inhibitory potency against tryptase
In DepthDetails ArticlePubMed
TargetSerine protease 1(Homo sapiens (Human))
Axys Pharmaceuticals
Curated by ChEMBL
LigandPNGBDBM50093158(1-{4-[4-amino(imino)methylaminobenzylcarbamoyl]hex...)
Affinity DataKi:  1.29E+5nM. Assay description: Compound was evaluated for its inhibitory potency against trypsin
In DepthDetails ArticlePubMed
TargetPlasminogen(Homo sapiens (Human))
Axys Pharmaceuticals
Curated by ChEMBL
LigandPNGBDBM50093158(1-{4-[4-amino(imino)methylaminobenzylcarbamoyl]hex...)
Affinity DataKi: >1.00E+6nM. Assay description: Compound was evaluated for its inhibitory potency against plasmin
In DepthDetails ArticlePubMed
TargetProthrombin(Homo sapiens (Human))
Axys Pharmaceuticals
Curated by ChEMBL
LigandPNGBDBM50093158(1-{4-[4-amino(imino)methylaminobenzylcarbamoyl]hex...)
Affinity DataKi: >1.00E+6nM. Assay description: Compound was evaluated for its inhibitory potency against thrombin
In DepthDetails ArticlePubMed