BDBM50093378 2-(2-Hydroxymethyl-phenyl)-1H-benzoimidazole-4-carboxylic acid amide::CHEMBL133275
SMILES NC(=O)c1cccc2[nH]c(nc12)-c1ccccc1CO
InChI Key InChIKey=UZFHXNFVLKUHQQ-UHFFFAOYSA-N
Data  1 KI
  Tab Delimited (TSV)   2D SDfile   Computed 3D by Vconf -m prep SDfile
Find this compound or compounds like it in BindingDB:
Activity Spreadsheet -- Enzyme Inhibition Constant Data from BindingDB
Found 1 hit for monomerid = 50093378
TargetPoly [ADP-ribose] polymerase 1(Homo sapiens (Human))
Newcastle University
Curated by ChEMBL
LigandPNGBDBM50093378(2-(2-Hydroxymethyl-phenyl)-1H-benzoimidazole-4-car...)
Affinity DataKi:  10.6nM. Assay description: In vitro inhibition against human full length PARP protein
In DepthDetails ArticlePubMed