BDBM50093385 2-(2-Fluoro-phenyl)-1H-benzoimidazole-4-carboxylic acid amide::CHEMBL133353
SMILES NC(=O)c1cccc2[nH]c(nc12)-c1ccccc1F
InChI Key InChIKey=GBUMYZNGZUOLIR-UHFFFAOYSA-N
Data  1 KI
  Tab Delimited (TSV)   2D SDfile   Computed 3D by Vconf -m prep SDfile
Find this compound or compounds like it in BindingDB:
Activity Spreadsheet -- Enzyme Inhibition Constant Data from BindingDB
Found 1 hit for monomerid = 50093385
TargetPoly [ADP-ribose] polymerase 1(Homo sapiens (Human))
Newcastle University
Curated by ChEMBL
LigandPNGBDBM50093385(2-(2-Fluoro-phenyl)-1H-benzoimidazole-4-carboxylic...)
Affinity DataKi:  9nM. Assay description: In vitro inhibition against human full length PARP protein
In DepthDetails ArticlePubMed