BDBM50093668 CHEMBL3585806
SMILES COC(=O)CNC(=O)c1ccccc1N
InChI Key InChIKey=ODGVPIYZXIVBJM-UHFFFAOYSA-N
Data  2 IC50
  Tab Delimited (TSV)   2D SDfile   Computed 3D by Vconf -m prep SDfile
Find this compound or compounds like it in BindingDB:
Activity Spreadsheet -- Enzyme Inhibition Constant Data from BindingDB
Found 2 hits for monomerid = 50093668
TargetAmine oxidase [flavin-containing] B(Bos taurus)
Alexandria University
Curated by ChEMBL
LigandPNGBDBM50093668(CHEMBL3585806)
Affinity DataIC50:  8.50E+5nM. Assay description: Inhibition of bovine brain mitochondria MAO-B using benzylamine substrate after 60 mins by fluorimetric method
In DepthDetails ArticlePubMed
TargetAmine oxidase [flavin-containing] A(Bos taurus)
Alexandria University
Curated by ChEMBL
LigandPNGBDBM50093668(CHEMBL3585806)
Affinity DataIC50:  52nM. Assay description: Inhibition of bovine brain mitochondria MAO-A using serotonin substrate after 60 mins by fluorimetric method
In DepthDetails ArticlePubMed