BDBM50093860 CHEMBL76215::{2-Benzyloxy-1-[(1S,2R)-1-((S)-1-hydroxycarbamoyl-2-thiazol-4-yl-ethylcarbamoyl)-2-methyl-butylcarbamoyl]-ethyl}-carbamic acid benzyl ester
SMILES CC[C@@H](C)[C@H](NC(=O)C(COCc1ccccc1)NC(=O)OCc1ccccc1)C(=O)N[C@@H](Cc1cscn1)C(=O)NO
InChI Key InChIKey=FUSXMBHVTNKZLD-RYCUWDEASA-N
Data  1 IC50
  Tab Delimited (TSV)   2D SDfile   Computed 3D by Vconf -m prep SDfile
Find this compound or compounds like it in BindingDB:
Activity Spreadsheet -- Enzyme Inhibition Constant Data from BindingDB
Found 1 hit for monomerid = 50093860
TargetBone morphogenetic protein 1(Homo sapiens (Human))
Roche Bioscience
Curated by ChEMBL
LigandPNGBDBM50093860(CHEMBL76215 | {2-Benzyloxy-1-[(1S,2R)-1-((S)-1-hyd...)
Affinity DataIC50:  78nM. Assay description: Inhibitory effect against Procollagen C-terminal proteinase
In DepthDetails ArticlePubMed