BDBM50093884 3,4,5-Trihydroxy-benzoic acid (2E,6E,10E)-3,7,11,15-tetramethyl-hexadeca-2,6,10,14-tetraenyl ester::CHEMBL82679
SMILES [#6]\[#6](-[#6])=[#6]\[#6]-[#6]\[#6](-[#6])=[#6]\[#6]-[#6]\[#6](-[#6])=[#6]\[#6]-[#6]\[#6](-[#6])=[#6]\[#6]-[#8]-[#6](=O)-c1cc(-[#8])c(-[#8])c(-[#8])c1
InChI Key InChIKey=RVBFYPXDIKAGGS-FLPKSHQQSA-N
Data  1 IC50
  Tab Delimited (TSV)   2D SDfile   Computed 3D by Vconf -m prep SDfile
Find this compound or compounds like it in BindingDB:
Activity Spreadsheet -- Enzyme Inhibition Constant Data from BindingDB
Found 1 hit for monomerid = 50093884
TargetSqualene monooxygenase(Rattus norvegicus)
University Of Shizuoka
Curated by ChEMBL
LigandPNGBDBM50093884(3,4,5-Trihydroxy-benzoic acid (2E,6E,10E)-3,7,11,1...)
Affinity DataIC50:  4.50E+3nM. Assay description: Compound was evaluated for its inhibitory activity against recombinant rat SE(squalene epoxidase)
In DepthDetails ArticlePubMed