BDBM50093885 3,4,5-Trihydroxy-benzoic acid 10-phenyl-decyl ester::CHEMBL83999
SMILES Oc1cc(cc(O)c1O)C(=O)OCCCCCCCCCCc1ccccc1
InChI Key InChIKey=BOLVKNJMKZTVBF-UHFFFAOYSA-N
Data  1 IC50
  Tab Delimited (TSV)   2D SDfile   Computed 3D by Vconf -m prep SDfile
Find this compound or compounds like it in BindingDB:
Activity Spreadsheet -- Enzyme Inhibition Constant Data from BindingDB
Found 1 hit for monomerid = 50093885
TargetSqualene monooxygenase(Rattus norvegicus)
University Of Shizuoka
Curated by ChEMBL
LigandPNGBDBM50093885(3,4,5-Trihydroxy-benzoic acid 10-phenyl-decyl este...)
Affinity DataIC50:  1.53E+4nM. Assay description: Compound was evaluated for its inhibitory activity against recombinant rat SE(squalene epoxidase)
In DepthDetails ArticlePubMed