BDBM50094006 CHEMBL3585942
SMILES COCc1nc(C)ncc1OC[C@]1(C[C@H]1C(=O)Nc1ccc(cn1)C#N)c1ccccc1
InChI Key InChIKey=FVDMDGICJYHMRB-ICSRJNTNSA-N
Data  2 KI
  Tab Delimited (TSV)   2D SDfile   Computed 3D by Vconf -m prep SDfile
Find this compound or compounds like it in BindingDB:
Activity Spreadsheet -- Enzyme Inhibition Constant Data from BindingDB
Found 2 hits for monomerid = 50094006
TargetOrexin receptor type 2(Homo sapiens (Human))
Eisai
Curated by ChEMBL
LigandPNGBDBM50094006(CHEMBL3585942)
Affinity DataKi:  9nM. Assay description: Binding affinity to human OX2R by radioligand displacement binding assay
In DepthDetails ArticlePubMed
TargetOrexin/Hypocretin receptor type 1(Homo sapiens (Human))
Eisai
Curated by ChEMBL
LigandPNGBDBM50094006(CHEMBL3585942)
Affinity DataKi:  43nM. Assay description: Binding affinity to human OX1R by radioligand displacement binding assay
In DepthDetails ArticlePubMed