BDBM50094230 CHEMBL3586026
SMILES CCn1cc(cn1)-c1cnc(NCc2ccc3OCOc3c2)c(c1)C(=O)NC[C@H]1COc2ccccc2O1
InChI Key InChIKey=DUQSFLFKFAGWIS-UHFFFAOYSA-N
Data  2 IC50
  Tab Delimited (TSV)   2D SDfile   Computed 3D by Vconf -m prep SDfile
Find this compound or compounds like it in BindingDB:
Activity Spreadsheet -- Enzyme Inhibition Constant Data from BindingDB
Found 2 hits for monomerid = 50094230
TargetGrowth hormone secretagogue receptor type 1(Rattus norvegicus)
Asubio Pharma
Curated by ChEMBL
LigandPNGBDBM50094230(CHEMBL3586026)
Affinity DataIC50:  110nM. Assay description: Inverse agonist activity at rat ghrelin receptor expressed in HEK293 cells by NFAT-RE-luciferase reporter gene assay
In DepthDetails ArticlePubMed
TargetGrowth hormone secretagogue receptor type 1(Homo sapiens (Human))
Asubio Pharma
Curated by ChEMBL
LigandPNGBDBM50094230(CHEMBL3586026)
Affinity DataIC50:  24nM. Assay description: Binding affinity to ghrelin receptor (unknown origin)
In DepthDetails ArticlePubMed