BDBM50094352 CHEMBL140370::Trifluoro-methanesulfonic acid 2-(2-sulfamoyl-benzothiazol-6-yloxy)-ethyl ester
SMILES NS(=O)(=O)c1nc2ccc(OCCOS(=O)(=O)C(F)(F)F)cc2s1
InChI Key InChIKey=DMOIIDXHXUHFJK-UHFFFAOYSA-N
Data  3 KI
  Tab Delimited (TSV)   2D SDfile   Computed 3D by Vconf -m prep SDfile
Find this compound or compounds like it in BindingDB:
Activity Spreadsheet -- Enzyme Inhibition Constant Data from BindingDB
Found 3 hits for monomerid = 50094352
TargetCarbonic anhydrase 2(Homo sapiens (Human))
Universit£
Curated by ChEMBL
LigandPNGBDBM50094352(CHEMBL140370 | Trifluoro-methanesulfonic acid 2-(2...)
Affinity DataKi:  1nM. Assay description: Inhibition of human recombinant carbonic anhydrase II (CA2)
In DepthDetails ArticlePubMed
TargetCarbonic anhydrase 4(Bos taurus (bovine))
Universit£
Curated by ChEMBL
LigandPNGBDBM50094352(CHEMBL140370 | Trifluoro-methanesulfonic acid 2-(2...)
Affinity DataKi:  7nM. Assay description: Inhibition of bovine carbonic anhydrase IV (CA4) from bovine lung microsomes
In DepthDetails ArticlePubMed
TargetCarbonic anhydrase 1(Homo sapiens (Human))
Universit£
Curated by ChEMBL
LigandPNGBDBM50094352(CHEMBL140370 | Trifluoro-methanesulfonic acid 2-(2...)
Affinity DataKi:  50nM. Assay description: Inhibition of human recombinant carbonic anhydrase I (CA1)
In DepthDetails ArticlePubMed