BDBM50094554 2-methyl-1,3-diphenyl-4,5,6,7-tetrahydro-2H-isoindole::CHEMBL445127
SMILES Cn1c(c2CCCCc2c1-c1ccccc1)-c1ccccc1
InChI Key InChIKey=WEROLDWTIDUANL-UHFFFAOYSA-N
Data  2 IC50
  Tab Delimited (TSV)   2D SDfile   Computed 3D by Vconf -m prep SDfile
Find this compound or compounds like it in BindingDB:
Activity Spreadsheet -- Enzyme Inhibition Constant Data from BindingDB
Found 2 hits for monomerid = 50094554
TargetProstaglandin G/H synthase 2(Mus musculus (Mouse))
Dr Hs Gour University
Curated by ChEMBL
LigandPNGBDBM50094554(2-methyl-1,3-diphenyl-4,5,6,7-tetrahydro-2H-isoind...)
Affinity DataIC50: >1.00E+3nM. Assay description: Inhibition of mouse macrophage COX2
In DepthDetails ArticlePubMed
TargetProstaglandin G/H synthase 2(Mus musculus (Mouse))
Dr Hs Gour University
Curated by ChEMBL
LigandPNGBDBM50094554(2-methyl-1,3-diphenyl-4,5,6,7-tetrahydro-2H-isoind...)
Affinity DataIC50: >1.00E+3nM. Assay description: Inhibition against prostaglandin G/H synthase 2 from mouse resident macrophages
In DepthDetails ArticlePubMed