BDBM50094580 (3aS) -4-(5-Ethynyl-5-hydroxy-octahydro-4,7-methano-inden-2-ylidene)-cyclohexanone::CHEMBL346159
SMILES [#8][C@]1([#6]-[#6@@H]-2-[#6]-[#6@H]1-[#6@H]-1-[#6]\[#6](-[#6]-[#6@@H]-2-1)=[#6]-1\[#6]-[#6]-[#6](=O)-[#6]-[#6]-1)C#C
InChI Key InChIKey=XEZAZXYLKQFGBR-HILJTLORSA-N
Data  1 IC50
  Tab Delimited (TSV)   2D SDfile   Computed 3D by Vconf -m prep SDfile
Find this compound or compounds like it in BindingDB:
Activity Spreadsheet -- Enzyme Inhibition Constant Data from BindingDB
Found 1 hit for monomerid = 50094580
TargetAndrogen receptor(Rattus norvegicus (Rat))
The University Of Sydney
Curated by ChEMBL
LigandPNGBDBM50094580((3aS) -4-(5-Ethynyl-5-hydroxy-octahydro-4,7-methan...)
Affinity DataIC50:  1.35E+4nM. Assay description: Ability to inhibit binding of [3H]R-1881 to rat ventral prostrate cytosolic androgen receptor was measured in a radioligand binding assay.
In DepthDetails ArticlePubMed