BDBM50094877 CHEMBL3589128
SMILES CC(C)C[C@H](NC(=O)[C@H](Cc1ccccc1)NC(=O)[C@H](Cn1cc(Cc2ccccc2)nn1)NC(=O)[C@H](CO)NC(=O)CN)C(N)=O
InChI Key InChIKey=DLHLAUJNPITBMI-FWEHEUNISA-N
Data  1 IC50
  Tab Delimited (TSV)   2D SDfile   Computed 3D by Vconf -m prep SDfile
Find this compound or compounds like it in BindingDB:
Activity Spreadsheet -- Enzyme Inhibition Constant Data from BindingDB
Found 1 hit for monomerid = 50094877
TargetGhrelin O-acyltransferase(Homo sapiens (Human))
Purdue University
Curated by ChEMBL
LigandPNGBDBM50094877(CHEMBL3589128)
Affinity DataIC50:  6.00E+3nM. Assay description: Inhibition of human GOAT octanoylation activity expressed in insect Sf9 cell membranes using GSSFLCAcDan as substrate after 1 hr by reverse phase HPL...
In DepthDetails ArticlePubMed