BDBM50095121 CHEMBL3589422
SMILES COc1ccc(OC\C=N\NC(N)=S)cc1
InChI Key InChIKey=DQQAZNBREIZBNP-WUXMJOGZSA-N
Data  1 EC50
  Tab Delimited (TSV)   2D SDfile   Computed 3D by Vconf -m prep SDfile
Find this compound or compounds like it in BindingDB:
Activity Spreadsheet -- Enzyme Inhibition Constant Data from BindingDB
Found 1 hit for monomerid = 50095121
TargetSterol carrier protein 2(Aedes aegypti)
Universidade Federal De Pernambuco
Curated by ChEMBL
LigandPNGBDBM50095121(CHEMBL3589422)
Affinity DataEC50:  600nM. Assay description: Inhibition of NBD-cholesterol binding to recombinant Aedes aegypti SCP-2 protein by fluorescence based assay
In DepthDetails ArticlePubMed