BDBM50095381 7-(4-Dimethylamino-phenyl)-5-methyl-pyrido[2,3-d]pyrimidin-4-ylamine::CHEMBL169250
SMILES CN(C)c1ccc(cc1)-c1cc(C)c2c(N)ncnc2n1
InChI Key InChIKey=KDFGUBRNVPBZGL-UHFFFAOYSA-N
Data  2 IC50
  Tab Delimited (TSV)   2D SDfile   Computed 3D by Vconf -m prep SDfile
Find this compound or compounds like it in BindingDB:
Activity Spreadsheet -- Enzyme Inhibition Constant Data from BindingDB
Found 2 hits for monomerid = 50095381
TargetAdenosine kinase(Rattus norvegicus (rat))
Abbott Laboratories
Curated by ChEMBL
LigandPNGBDBM50095381(7-(4-Dimethylamino-phenyl)-5-methyl-pyrido[2,3-d]p...)
Affinity DataIC50:  47nM. Assay description: Inhibitory activity against cytosolic adenosine kinase by ADO phosphorylation assay
In DepthDetails ArticlePubMed
TargetAdenosine kinase(Rattus norvegicus (rat))
Abbott Laboratories
Curated by ChEMBL
LigandPNGBDBM50095381(7-(4-Dimethylamino-phenyl)-5-methyl-pyrido[2,3-d]p...)
Affinity DataIC50: >1.00E+3nM. Assay description: Inhibitory activity against intact cell adenosine kinase by ADO phosphorylation assay
In DepthDetails ArticlePubMed