BDBM50095457 CHEMBL3590425
SMILES CCCN(C)CCCCC(=O)N(O)CCC(O)=O
InChI Key InChIKey=JZCDGXAGZDVQKZ-UHFFFAOYSA-N
Data  2 IC50
  Tab Delimited (TSV)   2D SDfile   Computed 3D by Vconf -m prep SDfile
Find this compound or compounds like it in BindingDB:
Activity Spreadsheet -- Enzyme Inhibition Constant Data from BindingDB
Found 2 hits for monomerid = 50095457
TargetLysine-specific demethylase 4C(Homo sapiens (Human))
Kyoto Prefectural University Of Medicine
Curated by ChEMBL
LigandPNGBDBM50095457(CHEMBL3590425)
Affinity DataIC50:  7.60E+4nM. Assay description: Inhibition of JMJD2C (unknown origin) using H3K9mel peptide
In DepthDetails ArticlePubMed
TargetLysine-specific demethylase 5A(Homo sapiens (Human))
Kyoto Prefectural University Of Medicine
Curated by ChEMBL
LigandPNGBDBM50095457(CHEMBL3590425)
Affinity DataIC50:  8.90E+3nM. Assay description: Inhibition of JARID1A (unknown origin) using biotinylated H3K9mel peptide after 60 mins by Alpha screen assay
In DepthDetails ArticlePubMed