BDBM50095643 CHEMBL3590447
SMILES [O-][N+](=O)c1ccc(CCN(CCF)CCOc2ccc(cc2)[N+]([O-])=O)cc1
InChI Key InChIKey=GRUHJMZPKAVTMD-UHFFFAOYSA-N
Data  1 KI  1 Kd
  Tab Delimited (TSV)   2D SDfile   Computed 3D by Vconf -m prep SDfile
Find this compound or compounds like it in BindingDB:
Activity Spreadsheet -- Enzyme Inhibition Constant Data from BindingDB
Found 2 hits for monomerid = 50095643
TargetPotassium voltage-gated channel subfamily H member 2(Homo sapiens (Human))
Leiden University
Curated by ChEMBL
LigandPNGBDBM50095643(CHEMBL3590447)
Affinity DataKi:  65nM. Assay description: Displacement of [3H]dofetilide from human Kv11.1 expressed in HEK293 cell membranes by competitive radioligand displacement assay
In DepthDetails ArticlePubMed
TargetPotassium voltage-gated channel subfamily H member 2(Homo sapiens (Human))
Leiden University
Curated by ChEMBL
LigandPNGBDBM50095643(CHEMBL3590447)
Affinity DataKd:  41nM. Assay description: Binding affinity to human Kv11.1 expressed in HEK293 cell membranes assessed as binding affinity constant by [3H]dofetilide competition association a...
In DepthDetails ArticlePubMed