BDBM50095838 CHEMBL3590600
SMILES COc1cc(C[C@@H](CO)O[C@@H]2O[C@H](COC(=O)c3cc(O)c(O)c(O)c3)[C@@H](O)[C@H](O)[C@H]2O)ccc1O
InChI Key InChIKey=CGYRWWMWNACLSU-PVOJZGJBSA-N
Data  1 IC50
  Tab Delimited (TSV)   2D SDfile   Computed 3D by Vconf -m prep SDfile
Find this compound or compounds like it in BindingDB:
Activity Spreadsheet -- Enzyme Inhibition Constant Data from BindingDB
Found 1 hit for monomerid = 50095838
TargetTyrosyl-DNA phosphodiesterase 1(Homo sapiens (Human))
Griffith University
Curated by ChEMBL
LigandPNGBDBM50095838(CHEMBL3590600)
Affinity DataIC50:  1.00E+3nM. Assay description: Inhibition of Tdp1 (unknown origin) incubated for 30 mins using 5'-/6-TAMN/AGGATCTAAAAGACTT/3BHQ_2/-3' substrate by microplate reader based assay
In DepthDetails ArticlePubMed