BDBM50096089 2-(3-Aminomethyl-phenyl)-5-trifluoromethyl-2H-pyrazole-3-carboxylic acid (2'-sulfamoyl-biphenyl-4-yl)-amide::CHEMBL154504
SMILES NCc1cccc(c1)-n1nc(cc1C(=O)Nc1ccc(cc1)-c1ccccc1S(N)(=O)=O)C(F)(F)F
InChI Key InChIKey=OYPIEVKYTCFQOU-UHFFFAOYSA-N
Data  4 KI
  Tab Delimited (TSV)   2D SDfile   Computed 3D by Vconf -m prep SDfile
Find this compound or compounds like it in BindingDB:
Activity Spreadsheet -- Enzyme Inhibition Constant Data from BindingDB
Found 4 hits for monomerid = 50096089
TargetCoagulation factor X(Homo sapiens (Human))
Dupont Pharmaceuticals
Curated by ChEMBL
LigandPNGBDBM50096089(2-(3-Aminomethyl-phenyl)-5-trifluoromethyl-2H-pyra...)
Affinity DataKi:  2.10nM. Assay description: In vitro activity against rabbit FXa.
In DepthDetails ArticlePubMed
TargetSerine protease 1/Trypsin-2(Homo sapiens (Human))
Dupont Pharmaceuticals
Curated by ChEMBL
LigandPNGBDBM50096089(2-(3-Aminomethyl-phenyl)-5-trifluoromethyl-2H-pyra...)
Affinity DataKi:  120nM. Assay description: In vitro activity against human trypsin.
In DepthDetails ArticlePubMed
TargetCoagulation factor X(Homo sapiens (Human))
Dupont Pharmaceuticals
Curated by ChEMBL
LigandPNGBDBM50096089(2-(3-Aminomethyl-phenyl)-5-trifluoromethyl-2H-pyra...)
Affinity DataKi:  910nM. Assay description: Binding affinity against human coagulation factor X
In DepthDetails ArticlePubMed
TargetProthrombin(Homo sapiens (Human))
Dupont Pharmaceuticals
Curated by ChEMBL
LigandPNGBDBM50096089(2-(3-Aminomethyl-phenyl)-5-trifluoromethyl-2H-pyra...)
Affinity DataKi:  1.40E+4nM. Assay description: In vitro activity against human thrombin.
In DepthDetails ArticlePubMed