BDBM50096147 CHEMBL3593991
SMILES NC(=O)c1cccc2[nH]c(nc12)-c1ccc(cc1)-c1ccc(OCCCN2CCCCC2)cc1
InChI Key InChIKey=MDIRAJUGZDCFCD-UHFFFAOYSA-N
Data  1 IC50
  Tab Delimited (TSV)   2D SDfile   Computed 3D by Vconf -m prep SDfile
Find this compound or compounds like it in BindingDB:
Activity Spreadsheet -- Enzyme Inhibition Constant Data from BindingDB
Found 1 hit for monomerid = 50096147
TargetPoly [ADP-ribose] polymerase 1(Homo sapiens (Human))
University Of Malaya
Curated by ChEMBL
LigandPNGBDBM50096147(CHEMBL3593991)
Affinity DataIC50:  2.28E+3nM. Assay description: Inhibition of PARP-1 (unknown origin) assessed as incorporation of biotinylated poly (ADP-ribose) onto histone protein after 60 mins by TACS-Sapphire...
In DepthDetails ArticlePubMed