BDBM50096150 CHEMBL3593994
SMILES CCC(=O)Nc1ccc(cc1)-c1ccc(cc1)-c1nc2c(cc(F)cc2[nH]1)C(N)=O
InChI Key InChIKey=GODKWHBVIMYRLT-UHFFFAOYSA-N
Data  1 IC50
  Tab Delimited (TSV)   2D SDfile   Computed 3D by Vconf -m prep SDfile
Find this compound or compounds like it in BindingDB:
Activity Spreadsheet -- Enzyme Inhibition Constant Data from BindingDB
Found 1 hit for monomerid = 50096150
TargetPoly [ADP-ribose] polymerase 1(Homo sapiens (Human))
University Of Malaya
Curated by ChEMBL
LigandPNGBDBM50096150(CHEMBL3593994)
Affinity DataIC50:  1.72E+3nM. Assay description: Inhibition of PARP-1 (unknown origin) assessed as incorporation of biotinylated poly (ADP-ribose) onto histone protein after 60 mins by TACS-Sapphire...
In DepthDetails ArticlePubMed