BDBM50096252 CHEMBL3594198
SMILES OP(O)(=O)Cc1ccc(CCl)cc1
InChI Key InChIKey=RNCSZGBXJLKGAX-ZMYYMYRNSA-N
Data  1 KI
  Tab Delimited (TSV)   2D SDfile   Computed 3D by Vconf -m prep SDfile
Find this compound or compounds like it in BindingDB:
Activity Spreadsheet -- Enzyme Inhibition Constant Data from BindingDB
Found 1 hit for monomerid = 50096252
TargetLow molecular weight phosphotyrosine protein phosphatase(Mus musculus)
University Of Campinas
Curated by ChEMBL
LigandPNGBDBM50096252(CHEMBL3594198)
Affinity DataKi:  4.70E+4nM. Assay description: Competitive inhibition of mouse LMW-PTP expressed in Escherichia coli using pNPP substrate by Dixon plot
In DepthDetails ArticlePubMed