BDBM50096394 Benzo[b]thiophene-2-carboxylic acid [(R)-3-methyl-1-((R)-4-oxo-tetrahydro-furan-3-ylcarbamoyl)-butyl]-amide::CHEMBL61563
SMILES CC(C)C[C@@H](NC(=O)c1cc2ccccc2s1)C(=O)N[C@@H]1COCC1=O
InChI Key InChIKey=IOQKOISMPDGVFY-ZIAGYGMSSA-N
Data  1 KI
  Tab Delimited (TSV)   2D SDfile   Computed 3D by Vconf -m prep SDfile
Find this compound or compounds like it in BindingDB:
Activity Spreadsheet -- Enzyme Inhibition Constant Data from BindingDB
Found 1 hit for monomerid = 50096394
TargetCathepsin K(Homo sapiens (Human))
Smithkline Beecham Pharmaceuticals
Curated by ChEMBL
LigandPNGBDBM50096394(Benzo[b]thiophene-2-carboxylic acid [(R)-3-methyl-...)
Affinity DataKi:  68nM. Assay description: Inhibition of cathepsin K
In DepthDetails ArticlePubMed