BDBM50096635 CHEMBL3577271
SMILES OC(=O)[C@@H]1CCc2c(C1)[nH]c1ccc(I)cc21
InChI Key
Data  1 KI  1 IC50
  Tab Delimited (TSV)   2D SDfile   Computed 3D by Vconf -m prep SDfile
Find this compound or compounds like it in BindingDB:
Activity Spreadsheet -- Enzyme Inhibition Constant Data from BindingDB
Found 2 hits for monomerid = 50096635
TargetBeta sliding clamp(Escherichia coli (strain K12))
The University Of Wollongong And The Illawarra Health And Medical Research Institute
Curated by ChEMBL
LigandPNGBDBM50096635(CHEMBL3577271)
Affinity DataKi:  9.70E+4nM. Assay description: Inhibition of Escherichia coli DNA sliding clamp protein using N-fluorescein (FAM)-QLDLF-OH tracer by fluorescence polarization assay
In DepthDetails ArticlePubMed
TargetBeta sliding clamp(Escherichia coli (strain K12))
The University Of Wollongong And The Illawarra Health And Medical Research Institute
Curated by ChEMBL
LigandPNGBDBM50096635(CHEMBL3577271)
Affinity DataIC50:  1.75E+5nM. Assay description: Inhibition of Escherichia coli DNA sliding clamp protein using N-fluorescein (FAM)-QLDLF-OH tracer by fluorescence polarization assay
In DepthDetails ArticlePubMed