BDBM50096732 4-[3-Carboxy-2-(3-carboxy-propionylamino)-propionylamino]-4-[1-(2,2-dimethyl-1-{3-methyl-1-[3,3,3-trifluoro-1-(1-naphthalen-2-yl-propylaminooxalyl)-propylcarbamoyl]-butylcarbamoyl}-propylcarbamoyl)-2-o-tolyl-ethylcarbamoyl]-butyric acid::CHEMBL412493
SMILES CC[C@H](NC(=O)C(=O)[C@@H](CC(F)(F)F)NC(=O)[C@H](CC(C)C)NC(=O)[C@@H](NC(=O)[C@H](Cc1ccccc1C)NC(=O)[C@H](CCC(O)=O)NC(=O)[C@H](CC(O)=O)NC(=O)CCC(O)=O)C(C)(C)C)c1ccc2ccccc2c1
InChI Key InChIKey=GOWAZEHKZOVILU-DAZOYDDBSA-N
Data  1 IC50
  Tab Delimited (TSV)   2D SDfile   Computed 3D by Vconf -m prep SDfile
Find this compound or compounds like it in BindingDB:
Activity Spreadsheet -- Enzyme Inhibition Constant Data from BindingDB
Found 1 hit for monomerid = 50096732
TargetGenome polyprotein/Non-structural protein 4A(Hepatitis C virus)
Roche Discover Welwyn
Curated by ChEMBL
LigandPNGBDBM50096732(4-[3-Carboxy-2-(3-carboxy-propionylamino)-propiony...)
Affinity DataIC50:  8nM. Assay description: Inhibitory activity against non-nucleoside reverse transcriptase inhibitors (NNRTI) -resistant HIV-1 strain A17 with a Y181C mutation in RT (reverse ...
In DepthDetails ArticlePubMed