BDBM50096844 CHEMBL3580753
SMILES Oc1cc(=O)[nH]c2ccc(cc12)-c1nc([nH]c1Cl)[C@H](Cc1ccccc1)NC(=O)CCc1cc(Cl)ccc1-n1cnnn1
InChI Key InChIKey=RIBKAHDCEPFDLG-QYSZHFNSSA-N
Data  1 KI
  Tab Delimited (TSV)   2D SDfile   Computed 3D by Vconf -m prep SDfile
Find this compound or compounds like it in BindingDB:
Activity Spreadsheet -- Enzyme Inhibition Constant Data from BindingDB
Found 1 hit for monomerid = 50096844
TargetCoagulation factor XI(Homo sapiens (Human))
Bristol-Myers Squibb
Curated by ChEMBL
LigandPNGBDBM50096844(CHEMBL3580753)
Affinity DataKi:  0.320nM. Assay description: Inhibition of human coagulation factor 11a using p-nitroaniline as substrate assessed as substrate hydrolysis by spectrophotometry
In DepthDetails ArticlePubMed