BDBM50097638 3-(10,11-Dihydro-dibenzo[b,f]azepin-5-yl)-propylamine::CHEMBL1317::Didesmethylimipramine
SMILES NCCCN1c2ccccc2CCc2ccccc12
InChI Key InChIKey=XJWJQDZWUYUIEM-UHFFFAOYSA-N
Data  1 KI
  Tab Delimited (TSV)   2D SDfile   Computed 3D by Vconf -m prep SDfile
Find this compound or compounds like it in BindingDB:
Activity Spreadsheet -- Enzyme Inhibition Constant Data from BindingDB
Found 1 hit for monomerid = 50097638
Target5-hydroxytryptamine receptor 2A(Homo sapiens (Human))
Virginia Commonwealth University
Curated by ChEMBL
LigandPNGBDBM50097638(3-(10,11-Dihydro-dibenzo[b,f]azepin-5-yl)-propylam...)
Affinity DataKi:  397nM. Assay description: Displacement of [3H]ketanserin from 5-hydroxytryptamine 2A receptor expressed NIH3T3 cells
In DepthDetails ArticlePubMed