BDBM50097912 3-(1-{2-[(R)-4-Benzoyl-2-(3,4-difluoro-phenyl)-morpholin-2-yl]-ethyl}-4-phenyl-piperidin-4-yl)-1,1-dimethyl-urea::CHEMBL354422
SMILES CN(C)C(=O)NC1(CCN(CC[C@]2(CN(CCO2)C(=O)c2ccccc2)c2ccc(F)c(F)c2)CC1)c1ccccc1
InChI Key InChIKey=QNLIUVLFRVYNCV-XIFFEERXSA-N
Data  1 IC50
  Tab Delimited (TSV)   2D SDfile   Computed 3D by Vconf -m prep SDfile
Find this compound or compounds like it in BindingDB:
Activity Spreadsheet -- Enzyme Inhibition Constant Data from BindingDB
Found 1 hit for monomerid = 50097912
TargetSubstance-K receptor(Homo sapiens (Human))
University Of Leeds
Curated by ChEMBL
LigandPNGBDBM50097912(3-(1-{2-[(R)-4-Benzoyl-2-(3,4-difluoro-phenyl)-mor...)
Affinity DataIC50:  6nM. Assay description: Binding affinity of the compound for heterologously expressed human Tachykinin receptor 2 using [3H]-SR- 48968 as radioligand
In DepthDetails ArticlePubMed